{"text_format":"3","workbook":"xlsx","n_sheets":4,"sheets":["Recibo","CONF","Dados","LocalizarRecibo"],"not_rendered":{"macros":1,"defined_names":6},"read":"whole","date_system":"1900"}

{"sheet":"Recibo","index":0,"n_rows":40,"n_cols":14,"rows_kept":40,"merged":[[2,13,2,16],[5,6,5,16],[7,5,8,16],[10,7,10,16],[11,4,11,16],[14,4,14,8],[14,10,14,16],[17,7,17,14],[24,13,24,16],[27,6,27,16],[29,5,30,16],[32,7,32,16],[33,4,33,16],[36,4,36,8],[36,10,36,16],[39,7,39,14]]}
[]
[]
[{"$nulls":7},2,{"$nulls":5},{"v":1333,"d":"R$ 1,333.00"}]
[]
[]
[{"$nulls":6},"Sandra"]
[]
[{"$nulls":5},{"$f":"IF(N3=\"\",\"\",SUBSTITUTE(SUBSTITUTE(PROPER(fExtenso(N3,1/3,\"Real\",\"Reais\")),\" E \", \" e \"), \" De \", \" de \"))","v":"Um Mil Trezentos e Trinta e Três Reais"}]
[]
[]
[{"$nulls":7},"Teste"]
[{"$nulls":4},"teste2"]
[]
[]
[{"$nulls":4},"Schroeder",{"$nulls":5},{"$f":"TODAY()","v":"2013-08-08"}]
[]
[]
[{"$nulls":7},"Teste"]
[]
[]
[]
[]
[]
[]
[{"$nulls":7},{"$f":"IF(H3=\"\",\"\",H3)","v":2},{"$nulls":5},{"$f":"IF(N3=\"\",\"\",N3)","v":{"v":1333,"d":"R$ 1,333.00"}}]
[]
[]
[{"$nulls":6},{"$f":"IF(G6=\"\",\"\",G6)","v":"Sandra"}]
[]
[{"$nulls":5},{"$f":"PRI.MAIÚSCULA","v":"Um Mil Trezentos e Trinta e Três Reais"}]
[]
[]
[{"$nulls":7},{"$f":"IF(H11=\"\",\"\",H11)","v":"Teste"}]
[{"$nulls":4},{"$f":"IF(E12=\"\",\"\",E12)","v":"teste2"}]
[]
[]
[{"$nulls":4},{"$f":"IF(E15=\"\",\"\",E15)","v":"Schroeder"},{"$nulls":5},{"$f":"K15","v":"2013-08-08"}]
[]
[]
[{"$nulls":7},{"$f":"IF(H18=\"\",\"\",H18)","v":"Teste"}]

{"sheet":"CONF","index":1,"n_rows":4,"n_cols":2,"rows_kept":4,"hidden":true}
[]
[]
["Último Recibo:",{"$f":"IFERROR(MAX(nrecibo),0)","v":2}]
["Próximo Nº:",{"$f":"B3+1","v":3}]

{"sheet":"Dados","index":2,"n_rows":3,"n_cols":8,"rows_kept":3}
[null,"Nº Recibo","Valor","Sacado","Descrição","Data","Nome/CPF","Cidade"]
[null,1,{"v":1500,"d":"1,500.00"},"Teste","Teste","2013-08-08","teste","Schroeder"]
[null,2,{"v":1333,"d":"1,333.00"},"Sandra","Teste","2013-08-08","Teste","Schroeder"]

{"sheet":"LocalizarRecibo","index":3,"n_rows":38,"n_cols":14,"rows_kept":38,"merged":[[2,13,2,16],[5,6,5,16],[7,5,8,16],[10,7,10,16],[11,4,11,16],[14,4,14,8],[14,10,14,16],[17,7,17,14],[22,13,22,16],[25,6,25,16],[27,5,28,16],[30,7,30,16],[31,4,31,16],[34,4,34,8],[34,10,34,16],[37,7,37,14]]}
[]
[]
[{"$nulls":7},1,{"$nulls":5},{"$f":"IFERROR(VLOOKUP(H3,dados_recibo,2,0),\"\")","v":{"v":1500,"d":"R$ 1,500.00"}}]
[]
[]
[{"$nulls":6},{"$f":"IFERROR(VLOOKUP($H$3,dados_recibo,3,0),\"\")","v":"Teste"}]
[]
[{"$nulls":5},{"$f":"IF(N3=\"\",\"\",SUBSTITUTE(SUBSTITUTE(PROPER(fExtenso(N3,1/3,\"Real\",\"Reais\")),\" E \", \" e \"), \" De \", \" de \"))","v":"Um Mil e Quinhentos Reais"}]
[]
[]
[{"$nulls":7},{"$f":"IFERROR(VLOOKUP($H$3,dados_recibo,4,0),\"\")","v":"Teste"}]
[]
[]
[]
[{"$nulls":4},{"$f":"IFERROR(VLOOKUP($H$3,dados_recibo,4,0),\"\")","v":"Teste"},{"$nulls":5},{"$f":"IFERROR(VLOOKUP($H$3,dados_recibo,5,0),\"\")","v":"2013-08-08"}]
[]
[]
[{"$nulls":7},{"$f":"IFERROR(VLOOKUP($H$3,dados_recibo,6,0),\"\")","v":"teste"}]
[]
[]
[]
[]
[{"$nulls":7},{"$f":"IF(H3=\"\",\"\",H3)","v":1},{"$nulls":5},{"$f":"IF(N3=\"\",\"\",N3)","v":{"v":1500,"d":"R$ 1,500.00"}}]
[]
[]
[{"$nulls":6},{"$f":"IF(G6=\"\",\"\",G6)","v":"Teste"}]
[]
[{"$nulls":5},{"$f":"PRI.MAIÚSCULA","v":"Um Mil e Quinhentos Reais"}]
[]
[]
[{"$nulls":7},{"$f":"IF(H11=\"\",\"\",H11)","v":"Teste"}]
[]
[]
[]
[{"$nulls":4},{"$f":"IF(E15=\"\",\"\",E15)","v":"Teste"},{"$nulls":5},{"$f":"IFERROR(VLOOKUP($H$3,dados_recibo,5,0),\"\")","v":"2013-08-08"}]
[]
[]
[{"$nulls":7},{"$f":"IFERROR(VLOOKUP($H$3,dados_recibo,6,0),\"\")","v":"teste"}]